Reaction Details
TargetPapain
LigandBDBM50157741
Substrate/Competitorn/a
Meas. Tech.ChEMBL_499481 (CHEMBL1021973)
IC50 47±n/a nM
Citation Martins, FTAssis, DMDos Santos, MHCamps, IVeloso, MPJuliano, MAAlves, LCDoriguetto, AC Natural polyprenylated benzophenones inhibiting cysteine and serine proteases. Eur J Med Chem44:1230-9 (2009) 
 
Papain
Name:Papain
Type:Enzyme
Mol. Mass.:38923.01
Organism:Carica papaya
Description:Papain was purchased from Sigma, Germany.
Residue:345
BDBM50157741
NameBDBM50157741
Synonyms:CHEMBL374508 E64
TypeSmall organic molecule
Emp. Form.C15H27N5O5
Mol. Mass.357.4054
SMILES[#6]-[#6](-[#6])-[#6]-[#6@H](-[#7]-[#6](=O)-[#6@H]-1-[#8]-[#6@@H]-1-[#6](-[#8])=O)-[#6](=O)-[#7]-[#6]-[#6]-[#6]-[#6]\[#7]=[#6](/[#7])-[#7]