Reaction Details
TargetSodium-dependent serotonin transporter
LigandBDBM84745
Substrate/Competitorn/a
Meas. Tech.ChEMBL_500246 (CHEMBL966884)
IC50 3±n/a nM
Citation Vu, ATCohn, STTerefenko, EAMoore, WJZhang, PMahaney, PETrybulski, EJGoljer, IDooley, RBray, JAJohnston, GHLeiter, JDeecher, DC 3-(Arylamino)-3-phenylpropan-2-olamines as a new series of dual norepinephrine and serotonin reuptake inhibitors. Bioorg Med Chem Lett19:2464-7 (2009) 
 
Sodium-dependent serotonin transporter
Name:Sodium-dependent serotonin transporter
Type:Multi-pass membrane protein
Mol. Mass.:70322.51
Organism:Homo sapiens (Human)
Description:P31645
Residue:630
BDBM84745
NameBDBM84745
Synonyms:CAS_136434-34-9 LY-248686 USRE49340, Rank 5
TypeSmall organic molecule
Emp. Form.C18H19NOS
Mol. Mass.297.415
SMILESCNCC[C@H](Oc1cccc2ccccc12)c1cccs1