Reaction Details
TargetInsulin-like growth factor 1 receptor
LigandBDBM50271907
Substrate/Competitorn/a
Meas. Tech.ChEMBL_581974 (CHEMBL1058954)
IC50 7400±n/a nM
Citation Li, RPourpak, AMorris, SW Inhibition of the insulin-like growth factor-1 receptor (IGF1R) tyrosine kinase as a novel cancer therapy approach. J Med Chem52:4981-5004 (2010) 
 
Insulin-like growth factor 1 receptor
Name:Insulin-like growth factor 1 receptor
Type:PROTEIN
Mol. Mass.:155770.40
Organism:Mus musculus
Description:ChEMBL_820934
Residue:1373
BDBM50271907
NameBDBM50271907
Synonyms:2-(2-chlorobenzyl)-N4-(3-bromophenyl)-1H-indole-4,6-diamine N4-(3-bromophenyl)-6-(2-chlorobenzyl)-7H-pyrrolo[2,3-d]pyrimidine-2,4-diamine
TypeSmall organic molecule
Emp. Form.C19H15BrClN5
Mol. Mass.428.713
SMILESNc1nc(Nc2cccc(Br)c2)c2cc(Cc3ccccc3Cl)[nH]c2n1