Reaction Details
TargetReceptor tyrosine-protein kinase erbB-2
LigandBDBM50296347
Substrate/Competitorn/a
Meas. Tech.ChEMBL_581980 (CHEMBL1058960)
IC50>10000±n/a nM
Citation Li, RPourpak, AMorris, SW Inhibition of the insulin-like growth factor-1 receptor (IGF1R) tyrosine kinase as a novel cancer therapy approach. J Med Chem52:4981-5004 (2010) 
 
Receptor tyrosine-protein kinase erbB-2
Name:Receptor tyrosine-protein kinase erbB-2
Type:n/a
Mol. Mass.:137894.47
Organism:Homo sapiens (Human)
Description:P04626
Residue:1255
BDBM50296347
NameBDBM50296347
Synonyms:5-(3-(benzyloxy)phenyl)-7-(3-(pyrrolidin-1-yl)cyclobutyl)-7H-pyrrolo[2,3-d]pyrimidin-4-amine | CHEMBL558708
TypeSmall organic molecule
Emp. Form.C27H29N5O
Mol. Mass.439.5521
SMILESNc1ncnc2n(cc(-c3cccc(OCc4ccccc4)c3)c12)[C@H]1C[C@@H](C1)N1CCCC1