Reaction Details
TargetInsulin-like growth factor 1 receptor
LigandBDBM50296350
Substrate/Competitorn/a
Meas. Tech.ChEMBL_581989 (CHEMBL1058969)
IC50 68±n/a nM
Citation Li, RPourpak, AMorris, SW Inhibition of the insulin-like growth factor-1 receptor (IGF1R) tyrosine kinase as a novel cancer therapy approach. J Med Chem52:4981-5004 (2010) 
 
Insulin-like growth factor 1 receptor
Name:Insulin-like growth factor 1 receptor
Type:Protein
Mol. Mass.:154776.79
Organism:Homo sapiens (Human)
Description:P08069
Residue:1367
BDBM50296350
NameBDBM50296350
Synonyms:(S)-3-(4-(2-(4-(2-(2-chlorophenyl)-2-hydroxyethylamino)-2-oxo-1,2-dihydropyridin-3-yl)-7-methyl-1H-benzo[d]imidazol-5-yl)piperazin-1-yl)propanenitrile CHEMBL564417
TypeSmall organic molecule
Emp. Form.C28H30ClN7O2
Mol. Mass.532.037
SMILESCc1cc(cc2[nH]c(nc12)-c1c(NC[C@@H](O)c2ccccc2Cl)cc[nH]c1=O)N1CCN(CCC#N)CC1