Reaction Details
TargetInsulin-like growth factor 1 receptor
LigandBDBM50296348
Substrate/Competitorn/a
Meas. Tech.ChEMBL_581974 (CHEMBL1058954)
IC50 150±n/a nM
Citation Li, RPourpak, AMorris, SW Inhibition of the insulin-like growth factor-1 receptor (IGF1R) tyrosine kinase as a novel cancer therapy approach. J Med Chem52:4981-5004 (2010) 
 
Insulin-like growth factor 1 receptor
Name:Insulin-like growth factor 1 receptor
Type:PROTEIN
Mol. Mass.:155770.40
Organism:Mus musculus
Description:ChEMBL_820934
Residue:1373
BDBM50296348
NameBDBM50296348
Synonyms:7-(3-(azetidin-1-yl)cyclobutyl)-5-(3-(benzyloxy)phenyl)-7H-pyrrolo[2,3-d]pyrimidin-4-amine NVP-AEW541
TypeSmall organic molecule
Emp. Form.C26H27N5O
Mol. Mass.425.5255
SMILESNc1ncnc2n(cc(-c3cccc(OCc4ccccc4)c3)c12)[C@H]1C[C@@H](C1)N1CCC1