Reaction Details
TargetDipeptidyl peptidase 4
LigandBDBM11162
Substrate/Competitorn/a
Meas. Tech.ChEMBL_580724 (CHEMBL1057247)
IC50 18±n/a nM
Citation Wang, LZhang, BJi, JLi, BYan, JZhang, WWu, YWang, X Synthesis and evaluation of structurally constrained imidazolidin derivatives as potent dipeptidyl peptidase IV inhibitors. Eur J Med Chem44:3318-22 (2009) 
 
Dipeptidyl peptidase 4
Name:Dipeptidyl peptidase 4
Type:Enzyme
Mol. Mass.:88271.01
Organism:Homo sapiens (Human)
Description:P27487
Residue:766
BDBM11162
NameBDBM11162
Synonyms:(1R)-3-oxo-3-[3-(trifluoroethyl)-5,6-dihydro[1,2,4]triazolo[4,3-a]pyrazin-7(8H)-yl]-1-(2,4,5-trifluorobenzyl)propylamine CHEMBL393336 Sitagliptin Triazolopiperazine Analogue 1 | US10479798, Compound MK0431
TypeSmall organic molecule
Emp. Form.C16H15F6N5O
Mol. Mass.407.3136
SMILESN[C@@H](CC(=O)N1CCn2c(C1)nnc2C(F)(F)F)Cc1cc(F)c(F)cc1F