Reaction Details
TargetNeuronal acetylcholine receptor subunit alpha-7
LigandBDBM50296724
Substrate/Competitorn/a
Meas. Tech.ChEMBL_582484 (CHEMBL1058161)
Ki 9.5±n/a nM
Citation O'Donnell, CJPeng, LO'Neill, BTArnold, EPMather, RJSands, SBShrikhande, ALebel, LASpracklin, DKNedza, FM Synthesis and SAR studies of 1,4-diazabicyclo[3.2.2]nonane phenyl carbamates--subtype selective, high affinity alpha7 nicotinic acetylcholine receptor agonists. Bioorg Med Chem Lett19:4747-51 (2009) 
 
Neuronal acetylcholine receptor subunit alpha-7
Name:Neuronal acetylcholine receptor subunit alpha-7
Type:Enzyme
Mol. Mass.:56502.44
Organism:Rattus norvegicus (Rat)
Description:Q05941
Residue:502
BDBM50296724
NameBDBM50296724
Synonyms:3-bromophenyl 1,4-diazabicyclo[3.2.2]nonane-4-carboxylate | CHEMBL564821
TypeSmall organic molecule
Emp. Form.C14H17BrN2O2
Mol. Mass.325.201
SMILESBrc1cccc(OC(=O)N2CCN3CCC2CC3)c1