Reaction Details
TargetNeuronal acetylcholine receptor subunit alpha-4
LigandBDBM50296747
Substrate/Competitorn/a
Meas. Tech.ChEMBL_582486 (CHEMBL1058163)
IC50 2040±n/a nM
Citation O'Donnell, CJPeng, LO'Neill, BTArnold, EPMather, RJSands, SBShrikhande, ALebel, LASpracklin, DKNedza, FM Synthesis and SAR studies of 1,4-diazabicyclo[3.2.2]nonane phenyl carbamates--subtype selective, high affinity alpha7 nicotinic acetylcholine receptor agonists. Bioorg Med Chem Lett19:4747-51 (2009) 
 
Neuronal acetylcholine receptor subunit alpha-4
Name:Neuronal acetylcholine receptor subunit alpha-4
Type:Enzyme
Mol. Mass.:70196.44
Organism:Rattus norvegicus (Rat)
Description:P09483
Residue:630
BDBM50296747
NameBDBM50296747
Synonyms:3-benzoyl-4-bromophenyl 1,4-diazabicyclo[3.2.2]nonane-4-carboxylate | CHEMBL564825
TypeSmall organic molecule
Emp. Form.C21H21BrN2O3
Mol. Mass.429.307
SMILESBrc1ccc(OC(=O)N2CCN3CCC2CC3)cc1C(=O)c1ccccc1