Reaction Details
Target5-hydroxytryptamine receptor 2A
LigandBDBM50098551
Substrate/Competitorn/a
Meas. Tech.ChEMBL_584473 (CHEMBL1059152)
Ki>10000±n/a nM
Citation Zajdel, PSubra, GVerdie, PGabzdyl, EBojarski, AJDuszynska, BMartinez, JPawlowski, M Sulfonamides with the N-alkyl-N'-dialkylguanidine moiety as 5-HT7 receptor ligands. Bioorg Med Chem Lett19:4827-31 (2009) 
 
5-hydroxytryptamine receptor 2A
Name:5-hydroxytryptamine receptor 2A
Type:G Protein-Coupled Receptor (GPCR)
Mol. Mass.:52852.05
Organism:Rattus norvegicus (rat)
Description:Rat cortex membranes 5-HT2A receptors.
Residue:471
BDBM50098551
NameBDBM50098551
Synonyms:(R)-3-(2-(2-(4-methylpiperidin-1-yl)ethyl)pyrrolidin-1-ylsulfonyl)phenol 3-{(R)-2-[2-(4-Methyl-piperidin-1-yl)-ethyl]-pyrrolidine-1-sulfonyl}-phenol 3-{2-[2-(4-Methyl-piperidin-1-yl)-ethyl]-pyrrolidine-1-sulfonyl}-phenol CHEMBL282199 | SB-269970
TypeSmall organic molecule
Emp. Form.C18H28N2O3S
Mol. Mass.352.492
SMILESCC1CCN(CC[C@H]2CCCN2S(=O)(=O)c2cccc(O)c2)CC1