Reaction Details
TargetHydroxycarboxylic acid receptor 2
LigandBDBM50298001
Substrate/Competitorn/a
Meas. Tech.ChEMBL_585069 (CHEMBL1054335)
IC50 600±n/a nM
Citation Schmidt, DSmenton, ARaghavan, SCarballo-Jane, ELubell, SCiecko, THolt, TGWolff, MTaggart, AWilsie, LKrsmanovic, MRen, NBlom, DCheng, KMcCann, PEGerard Waters, MTata, JColletti, S Pyrazole acids as niacin receptor agonists for the treatment of dyslipidemia. Bioorg Med Chem Lett19:4768-72 (2009) 
 
Hydroxycarboxylic acid receptor 2
Name:Hydroxycarboxylic acid receptor 2
Type:G Protein-Coupled Receptor (GPCR)
Mol. Mass.:41868.22
Organism:Homo sapiens (Human)
Description:Membranes from CHO cells expressing the recombinant human GPR109A were used in competition binding assay.
Residue:363
BDBM50298001
NameBDBM50298001
Synonyms:(+/-)-5-(2-fluoropyridin-3-yl)-4,5,6,7-tetrahydro-1H-indazole-3-carboxylic acid 5-(2-fluoropyridin-3-yl)-4,5,6,7-tetrahydro-1H-indazole-3-carboxylic acid, hydrochloride CHEMBL539398
TypeSmall organic molecule
Emp. Form.C13H12FN3O2
Mol. Mass.261.2517
SMILESOC(=O)c1n[nH]c2CCC(Cc12)c1cccnc1F