Reaction Details
TargetCalcium/calmodulin-dependent protein kinase type 1D
LigandBDBM50326053
Substrate/Competitorn/a
Meas. Tech.ChEMBL_586559 (CHEMBL1052133)
Kd 670±n/a nM
Citation Karaman, MWHerrgard, STreiber, DKGallant, PAtteridge, CECampbell, BTChan, KWCiceri, PDavis, MIEdeen, PTFaraoni, RFloyd, MHunt, JPLockhart, DJMilanov, ZVMorrison, MJPallares, GPatel, HKPritchard, SWodicka, LMZarrinkar, PP A quantitative analysis of kinase inhibitor selectivity. Nat Biotechnol26:127-32 (2008) 
 
Calcium/calmodulin-dependent protein kinase type 1D
Name:Calcium/calmodulin-dependent protein kinase type 1D
Type:PROTEIN
Mol. Mass.:42916.83
Organism:Homo sapiens (Human)
Description:ChEMBL_586559
Residue:385
BDBM50326053
NameBDBM50326053
Synonyms:CHEMBL608533 | PKC-412
TypeSmall organic molecule
Emp. Form.C35H30N4O4
Mol. Mass.570.6371
SMILESCO[C@@H]1[C@@H](C[C@H]2O[C@]1(C)n1c3ccccc3c3c4CNC(=O)c4c4c5ccccc5n2c4c13)N(C)C(=O)c1ccccc1