Reaction Details
TargetRibosomal protein S6 kinase alpha-4
LigandBDBM5655
Substrate/Competitorn/a
Meas. Tech.ChEMBL_586491 (CHEMBL1051259)
Kd 1300±n/a nM
Citation Karaman, MWHerrgard, STreiber, DKGallant, PAtteridge, CECampbell, BTChan, KWCiceri, PDavis, MIEdeen, PTFaraoni, RFloyd, MHunt, JPLockhart, DJMilanov, ZVMorrison, MJPallares, GPatel, HKPritchard, SWodicka, LMZarrinkar, PP A quantitative analysis of kinase inhibitor selectivity. Nat Biotechnol26:127-32 (2008) 
 
Ribosomal protein S6 kinase alpha-4
Name:Ribosomal protein S6 kinase alpha-4
Type:Serine/threonine-protein kinase
Mol. Mass.:85620.38
Organism:Homo sapiens (Human)
Description:Recombinant MSK2 was phosphorylated by incubation with active p38alpha before assays.
Residue:772
BDBM5655
NameBDBM5655
Synonyms:2-(2-chlorophenyl)-5,7-dihydroxy-8-[(3S,4R)-3-hydroxy-1-methylpiperidin-4-yl]-4H-chromen-4-one Flavopiridol US9617225, Flavopiridol
TypeSmall organic molecule
Emp. Form.C21H20ClNO5
Mol. Mass.401.84
SMILESCN1CC[C@@H]([C@H](O)C1)c1c(O)cc(O)c2c1oc(cc2=O)-c1ccccc1Cl