Reaction Details
TargetInterleukin-1 receptor-associated kinase 3
LigandBDBM31090
Substrate/Competitorn/a
Meas. Tech.ChEMBL_586694 (CHEMBL1062842)
Kd>10000±n/a nM
Citation Karaman, MWHerrgard, STreiber, DKGallant, PAtteridge, CECampbell, BTChan, KWCiceri, PDavis, MIEdeen, PTFaraoni, RFloyd, MHunt, JPLockhart, DJMilanov, ZVMorrison, MJPallares, GPatel, HKPritchard, SWodicka, LMZarrinkar, PP A quantitative analysis of kinase inhibitor selectivity. Nat Biotechnol26:127-32 (2008) 
 
Interleukin-1 receptor-associated kinase 3
Name:Interleukin-1 receptor-associated kinase 3
Type:PROTEIN
Mol. Mass.:67767.98
Organism:Homo sapiens (Human)
Description:EBI_101055
Residue:596
BDBM31090
NameBDBM31090
Synonyms:(E)-N-[4-(3-chloro-4-fluoro-anilino)-3-cyano-7-ethoxy-6-quinolyl]-4-(dimethylamino)but-2-enamide (E)-N-[4-(3-chloro-4-fluoroanilino)-3-cyano-7-ethoxyquinolin-6-yl]-4-(dimethylamino)but-2-enamide EKB-569 cid_6445562
TypeSmall organic molecule
Emp. Form.C24H23ClFN5O2
Mol. Mass.467.923
SMILESCCOc1cc2ncc(C#N)c(Nc3ccc(F)c(Cl)c3)c2cc1NC(=O)\C=C\CN(C)C