Reaction Details
TargetCasein kinase I isoform gamma-2
LigandBDBM13531
Substrate/Competitorn/a
Meas. Tech.ChEMBL_586448 (CHEMBL1063704)
Kd>10000±n/a nM
Citation Karaman, MWHerrgard, STreiber, DKGallant, PAtteridge, CECampbell, BTChan, KWCiceri, PDavis, MIEdeen, PTFaraoni, RFloyd, MHunt, JPLockhart, DJMilanov, ZVMorrison, MJPallares, GPatel, HKPritchard, SWodicka, LMZarrinkar, PP A quantitative analysis of kinase inhibitor selectivity. Nat Biotechnol26:127-32 (2008) 
 
Casein kinase I isoform gamma-2
Name:Casein kinase I isoform gamma-2
Type:PROTEIN
Mol. Mass.:47475.36
Organism:Homo sapiens (Human)
Description:ChEMBL_774313
Residue:415
BDBM13531
NameBDBM13531
Synonyms:4-(4-Fluorophenyl)-2-(4-hydroxyphenyl)-5-(4-pyridyl)-1H-imidazole 4-[4-(4-fluorophenyl)-5-(4-pyridyl)-4-imidazolin-2-ylidene]cyclohexa-2,5-dien-1-one SB-202190 biotinylated SB202190
TypeSmall organic molecule
Emp. Form.C20H14FN3O
Mol. Mass.331.3431
SMILESOc1ccc(cc1)-c1nc(c([nH]1)-c1ccc(F)cc1)-c1ccncc1