Reaction Details
TargetMitogen-activated protein kinase 4
LigandBDBM31340
Substrate/Competitorn/a
Meas. Tech.ChEMBL_587183 (CHEMBL1060245)
Kd>10000±n/a nM
Citation Karaman, MWHerrgard, STreiber, DKGallant, PAtteridge, CECampbell, BTChan, KWCiceri, PDavis, MIEdeen, PTFaraoni, RFloyd, MHunt, JPLockhart, DJMilanov, ZVMorrison, MJPallares, GPatel, HKPritchard, SWodicka, LMZarrinkar, PP A quantitative analysis of kinase inhibitor selectivity. Nat Biotechnol26:127-32 (2008) 
 
Mitogen-activated protein kinase 4
Name:Mitogen-activated protein kinase 4
Type:Enzyme Catalytic Domain
Mol. Mass.:65906.37
Organism:Homo sapiens (Human)
Description:gi_89276769
Residue:587
BDBM31340
NameBDBM31340
Synonyms:2-methoxy-N-[(E)-3-[4-[3-methyl-4-(6-methylpyridin-3-yl)oxyanilino]quinazolin-6-yl]prop-2-enyl]acetamide 2-methoxy-N-[(E)-3-[4-[3-methyl-4-[(6-methyl-3-pyridyl)oxy]anilino]quinazolin-6-yl]allyl]acetamide CHEMBL483321 cid_9874913
TypeSmall organic molecule
Emp. Form.C27H27N5O3
Mol. Mass.469.535
SMILESCOCC(=O)NC\C=C\c1ccc2ncnc(Nc3ccc(Oc4ccc(C)nc4)c(C)c3)c2c1