Reaction Details
TargetMitogen-activated protein kinase 4
LigandBDBM6866
Substrate/Competitorn/a
Meas. Tech.ChEMBL_587183 (CHEMBL1060245)
Kd 1600±n/a nM
Citation Karaman, MWHerrgard, STreiber, DKGallant, PAtteridge, CECampbell, BTChan, KWCiceri, PDavis, MIEdeen, PTFaraoni, RFloyd, MHunt, JPLockhart, DJMilanov, ZVMorrison, MJPallares, GPatel, HKPritchard, SWodicka, LMZarrinkar, PP A quantitative analysis of kinase inhibitor selectivity. Nat Biotechnol26:127-32 (2008) 
 
Mitogen-activated protein kinase 4
Name:Mitogen-activated protein kinase 4
Type:Enzyme Catalytic Domain
Mol. Mass.:65906.37
Organism:Homo sapiens (Human)
Description:gi_89276769
Residue:587
BDBM6866
NameBDBM6866
Synonyms:1-Acyl-1H-[1,2,4]triazole-3,5-diamine Analogue 3b 4-[[5-Amino-1-(2,6-difluorobenzoyl)-1H-1,2,4-triazol-3-yl]amino]-benzenesulfonamide JNJ-7706621 | cid_5330790
TypeSmall organic molecule
Emp. Form.C15H12F2N6O3S
Mol. Mass.394.356
SMILESNc1nc(Nc2ccc(cc2)S(N)(=O)=O)nn1C(=O)c1c(F)cccc1F