Reaction Details
TargetEpithelial discoidin domain-containing receptor 1
LigandBDBM5931
Substrate/Competitorn/a
Meas. Tech.ChEMBL_586566 (CHEMBL1050825)
Kd>10000±n/a nM
Citation Karaman, MWHerrgard, STreiber, DKGallant, PAtteridge, CECampbell, BTChan, KWCiceri, PDavis, MIEdeen, PTFaraoni, RFloyd, MHunt, JPLockhart, DJMilanov, ZVMorrison, MJPallares, GPatel, HKPritchard, SWodicka, LMZarrinkar, PP A quantitative analysis of kinase inhibitor selectivity. Nat Biotechnol26:127-32 (2008) 
 
Epithelial discoidin domain-containing receptor 1
Name:Epithelial discoidin domain-containing receptor 1
Type:Tyrosine-protein kinase
Mol. Mass.:101130.02
Organism:Homo sapiens (Human)
Description:Q08345
Residue:913
BDBM5931
NameBDBM5931
Synonyms:BMS-387072 N-(5-{[(5-tert-butyl-1,3-oxazol-2-yl)methyl]sulfanyl}-1,3-thiazol-2-yl)piperidine-4-carboxamide cid_3025986
TypeSmall organic molecule
Emp. Form.C17H24N4O2S2
Mol. Mass.380.528
SMILESCC(C)(C)c1cnc(CSc2cnc(NC(=O)C3CCNCC3)s2)o1