Reaction Details
TargetCalcium/calmodulin-dependent protein kinase kinase 1
LigandBDBM17055
Substrate/Competitorn/a
Meas. Tech.ChEMBL_586687 (CHEMBL1062836)
Kd 5000±n/a nM
Citation Karaman, MWHerrgard, STreiber, DKGallant, PAtteridge, CECampbell, BTChan, KWCiceri, PDavis, MIEdeen, PTFaraoni, RFloyd, MHunt, JPLockhart, DJMilanov, ZVMorrison, MJPallares, GPatel, HKPritchard, SWodicka, LMZarrinkar, PP A quantitative analysis of kinase inhibitor selectivity. Nat Biotechnol26:127-32 (2008) 
 
Calcium/calmodulin-dependent protein kinase kinase 1
Name:Calcium/calmodulin-dependent protein kinase kinase 1
Type:PROTEIN
Mol. Mass.:55727.76
Organism:Homo sapiens (Human)
Description:ChEMBL_774623
Residue:505
BDBM17055
NameBDBM17055
Synonyms:(18S)-18-[(dimethylamino)methyl]-17-oxa-4,14,21-triazahexacyclo[19.6.1.1^{7,14}.0^{2,6}.0^{8,13}.0^{22,27}]nonacosa-1(28),2(6),7(29),8(13),9,11,22(27),23,25-nonaene-3,5-dione K00587a LY-333531 Ruboxistaurin | cid_153999
TypeSmall organic molecule
Emp. Form.C28H28N4O3
Mol. Mass.468.5469
SMILESCN(C)C[C@@H]1CCn2cc(C3=C(C(=O)NC3=O)c3cn(CCO1)c1ccccc31)c1ccccc21