Reaction Details
TargetMast/stem cell growth factor receptor Kit
LigandBDBM26300
Substrate/Competitorn/a
Meas. Tech.ChEMBL_586333 (CHEMBL1061077)
Kd 15±n/a nM
Citation Karaman, MWHerrgard, STreiber, DKGallant, PAtteridge, CECampbell, BTChan, KWCiceri, PDavis, MIEdeen, PTFaraoni, RFloyd, MHunt, JPLockhart, DJMilanov, ZVMorrison, MJPallares, GPatel, HKPritchard, SWodicka, LMZarrinkar, PP A quantitative analysis of kinase inhibitor selectivity. Nat Biotechnol26:127-32 (2008) 
 
Mast/stem cell growth factor receptor Kit
Name:Mast/stem cell growth factor receptor Kit
Type:Protein
Mol. Mass.:109869.37
Organism:Homo sapiens (Human)
Description:P10721
Residue:976
BDBM26300
NameBDBM26300
Synonyms:2-{3-[(7-{3-[ethyl(2-hydroxyethyl)amino]propoxy}quinazolin-4-yl)amino]-1H-pyrazol-5-yl}-N-(3-fluorophenyl)acetamide cid_16007391 | pyrazoloquinazoline deriv., 34
TypeSmall organic molecule
Emp. Form.C26H30FN7O3
Mol. Mass.507.5599
SMILESCCN(CCO)CCCOc1ccc2c(Nc3cc(CC(=O)Nc4cccc(F)c4)n[nH]3)ncnc2c1