Reaction Details
TargetReceptor-interacting serine/threonine-protein kinase 2
LigandBDBM26474
Substrate/Competitorn/a
Meas. Tech.ChEMBL_587101 (CHEMBL1051312)
Kd 580±n/a nM
Citation Karaman, MWHerrgard, STreiber, DKGallant, PAtteridge, CECampbell, BTChan, KWCiceri, PDavis, MIEdeen, PTFaraoni, RFloyd, MHunt, JPLockhart, DJMilanov, ZVMorrison, MJPallares, GPatel, HKPritchard, SWodicka, LMZarrinkar, PP A quantitative analysis of kinase inhibitor selectivity. Nat Biotechnol26:127-32 (2008) 
 
Receptor-interacting serine/threonine-protein kinase 2
Name:Receptor-interacting serine/threonine-protein kinase 2
Type:Protein
Mol. Mass.:61201.30
Organism:Homo sapiens (Human)
Description:n/a
Residue:540
BDBM26474
NameBDBM26474
Synonyms:5-({4-[(2,3-dimethyl-2H-indazol-6-yl)(methyl)amino]pyrimidin-2-yl}amino)-2-methylbenzene-1-sulfonamide JMC514632 Compound 13 cid_10113978
TypeSmall organic molecule
Emp. Form.C21H23N7O2S
Mol. Mass.437.518
SMILESCN(c1ccc2c(C)n(C)nc2c1)c1ccnc(Nc2ccc(C)c(c2)S(N)(=O)=O)n1