Reaction Details
TargetCyclin-dependent kinase 16
LigandBDBM5655
Substrate/Competitorn/a
Meas. Tech.ChEMBL_587091 (CHEMBL1051303)
Kd 440±n/a nM
Citation Karaman, MWHerrgard, STreiber, DKGallant, PAtteridge, CECampbell, BTChan, KWCiceri, PDavis, MIEdeen, PTFaraoni, RFloyd, MHunt, JPLockhart, DJMilanov, ZVMorrison, MJPallares, GPatel, HKPritchard, SWodicka, LMZarrinkar, PP A quantitative analysis of kinase inhibitor selectivity. Nat Biotechnol26:127-32 (2008) 
 
Cyclin-dependent kinase 16
Name:Cyclin-dependent kinase 16
Type:Protein
Mol. Mass.:55721.58
Organism:Homo sapiens (Human)
Description:Q00536
Residue:496
BDBM5655
NameBDBM5655
Synonyms:2-(2-chlorophenyl)-5,7-dihydroxy-8-[(3S,4R)-3-hydroxy-1-methylpiperidin-4-yl]-4H-chromen-4-one Flavopiridol US9617225, Flavopiridol
TypeSmall organic molecule
Emp. Form.C21H20ClNO5
Mol. Mass.401.84
SMILESCN1CC[C@@H]([C@H](O)C1)c1c(O)cc(O)c2c1oc(cc2=O)-c1ccccc1Cl