Reaction Details
TargetMembrane-associated tyrosine- and threonine-specific cdc2-inhibitory kinase
LigandBDBM5446
Substrate/Competitorn/a
Meas. Tech.ChEMBL_587209 (CHEMBL1061154)
Kd>10000±n/a nM
Citation Karaman, MWHerrgard, STreiber, DKGallant, PAtteridge, CECampbell, BTChan, KWCiceri, PDavis, MIEdeen, PTFaraoni, RFloyd, MHunt, JPLockhart, DJMilanov, ZVMorrison, MJPallares, GPatel, HKPritchard, SWodicka, LMZarrinkar, PP A quantitative analysis of kinase inhibitor selectivity. Nat Biotechnol26:127-32 (2008) 
 
Membrane-associated tyrosine- and threonine-specific cdc2-inhibitory kinase
Name:Membrane-associated tyrosine- and threonine-specific cdc2-inhibitory kinase
Type:PROTEIN
Mol. Mass.:54523.76
Organism:Homo sapiens (Human)
Description:ChEMBL_587209
Residue:499
BDBM5446
NameBDBM5446
Synonyms:CHEMBL553 Erlotinib N-(3-Ethynylphenyl)-6,7-bis(2-methoxyethoxy)-4-quinazolinamine Monohydrochloride OSI-774 US10189853, erlotinib US11524945, Compound Erlotinib US9730934, Erlotinib cid_176870
TypeSmall organic molecule
Emp. Form.C22H23N3O4
Mol. Mass.393.4357
SMILESCOCCOc1cc2ncnc(Nc3cccc(c3)C#C)c2cc1OCCOC