Reaction Details
TargetSerine/threonine-protein kinase receptor R3
LigandBDBM50110208
Substrate/Competitorn/a
Meas. Tech.ChEMBL_586811 (CHEMBL1063790)
Kd>10000±n/a nM
Citation Karaman, MWHerrgard, STreiber, DKGallant, PAtteridge, CECampbell, BTChan, KWCiceri, PDavis, MIEdeen, PTFaraoni, RFloyd, MHunt, JPLockhart, DJMilanov, ZVMorrison, MJPallares, GPatel, HKPritchard, SWodicka, LMZarrinkar, PP A quantitative analysis of kinase inhibitor selectivity. Nat Biotechnol26:127-32 (2008) 
 
Serine/threonine-protein kinase receptor R3
Name:Serine/threonine-protein kinase receptor R3
Type:Enzyme
Mol. Mass.:56134.46
Organism:Homo sapiens (Human)
Description:P37023
Residue:503
BDBM50110208
NameBDBM50110208
Synonyms:4-(4-(benzo[d][1,3]dioxol-5-yl)-5-(pyridin-2-yl)-1H-imidazol-2-yl)benzamide 4-(5-(benzo[d][1,3]dioxol-5-yl)-4-(pyridin-2-yl)-1H-imidazol-2-yl)benzamide CHEMBL440084 cid_4521392
TypeSmall organic molecule
Emp. Form.C22H16N4O3
Mol. Mass.384.3874
SMILESNC(=O)c1ccc(cc1)-c1nc(c([nH]1)-c1ccc2OCOc2c1)-c1ccccn1