Reaction Details
TargetCyclin-dependent kinase 8
LigandBDBM13530
Substrate/Competitorn/a
Meas. Tech.ChEMBL_587069 (CHEMBL1051283)
Kd>10000±n/a nM
Citation Karaman, MWHerrgard, STreiber, DKGallant, PAtteridge, CECampbell, BTChan, KWCiceri, PDavis, MIEdeen, PTFaraoni, RFloyd, MHunt, JPLockhart, DJMilanov, ZVMorrison, MJPallares, GPatel, HKPritchard, SWodicka, LMZarrinkar, PP A quantitative analysis of kinase inhibitor selectivity. Nat Biotechnol26:127-32 (2008) 
 
Cyclin-dependent kinase 8
Name:Cyclin-dependent kinase 8
Type:Serine/threonine-protein kinase
Mol. Mass.:53300.21
Organism:Homo sapiens (Human)
Description:P49336
Residue:464
BDBM13530
NameBDBM13530
Synonyms:4-[(4-methylpiperazin-1-yl)methyl]-N-[4-methyl-3-[(4-pyridin-3-ylpyrimidin-2-yl)amino]phenyl]benzamide Gleevec Imatinib, 21 STI-571 US10906896, Cpd imatinib US11725005, Compound imatinib cid_5291 med.21724, Compound 6
TypeSmall organic molecule
Emp. Form.C29H31N7O
Mol. Mass.493.6027
SMILESCN1CCN(Cc2ccc(cc2)C(=O)Nc2ccc(C)c(Nc3nccc(n3)-c3cccnc3)c2)CC1