Reaction Details
TargetProto-oncogene tyrosine-protein kinase receptor Ret
LigandBDBM21
Substrate/Competitorn/a
Meas. Tech.ChEMBL_586489 (CHEMBL1051257)
Kd 14±n/a nM
Citation Karaman, MWHerrgard, STreiber, DKGallant, PAtteridge, CECampbell, BTChan, KWCiceri, PDavis, MIEdeen, PTFaraoni, RFloyd, MHunt, JPLockhart, DJMilanov, ZVMorrison, MJPallares, GPatel, HKPritchard, SWodicka, LMZarrinkar, PP A quantitative analysis of kinase inhibitor selectivity. Nat Biotechnol26:127-32 (2008) 
 
Proto-oncogene tyrosine-protein kinase receptor Ret
Name:Proto-oncogene tyrosine-protein kinase receptor Ret
Type:Protein
Mol. Mass.:124318.29
Organism:Homo sapiens (Human)
Description:P07949
Residue:1114
BDBM21
NameBDBM21
Synonyms:CHEMBL24828 VANDETANIB ZD6474 | cid_3081361
Typen/a
Emp. Form.C22H24BrFN4O2
Mol. Mass.475.354
SMILESCOc1cc2c(Nc3ccc(Br)cc3F)ncnc2cc1OCC1CCN(C)CC1