Reaction Details
TargetEphrin type-A receptor 6
LigandBDBM21
Substrate/Competitorn/a
Meas. Tech.ChEMBL_586452 (CHEMBL1063707)
Kd 2400±n/a nM
Citation Karaman, MWHerrgard, STreiber, DKGallant, PAtteridge, CECampbell, BTChan, KWCiceri, PDavis, MIEdeen, PTFaraoni, RFloyd, MHunt, JPLockhart, DJMilanov, ZVMorrison, MJPallares, GPatel, HKPritchard, SWodicka, LMZarrinkar, PP A quantitative analysis of kinase inhibitor selectivity. Nat Biotechnol26:127-32 (2008) 
 
Ephrin type-A receptor 6
Name:Ephrin type-A receptor 6
Type:PROTEIN
Mol. Mass.:116385.76
Organism:Homo sapiens (Human)
Description:ChEMBL_774228
Residue:1036
BDBM21
NameBDBM21
Synonyms:CHEMBL24828 VANDETANIB ZD6474 | cid_3081361
Typen/a
Emp. Form.C22H24BrFN4O2
Mol. Mass.475.354
SMILESCOc1cc2c(Nc3ccc(Br)cc3F)ncnc2cc1OCC1CCN(C)CC1