Reaction Details
TargetCannabinoid receptor 2
LigandBDBM50298917
Substrate/Competitorn/a
Meas. Tech.ChEMBL_588142 (CHEMBL1049259)
Ki 721±n/a nM
Citation Silvestri, RLigresti, ALa Regina, GPiscitelli, FGatti, VBrizzi, APasquini, SLavecchia, AAllarà, MFantini, NCarai, MANovellino, EColombo, GDi Marzo, VCorelli, F Synthesis, cannabinoid receptor affinity, molecular modeling studies and in vivo pharmacological evaluation of new substituted 1-aryl-5-(1H-pyrrol-1-yl)-1H-pyrazole-3-carboxamides. 2. Effect of the 3-carboxamide substituent on the affinity and selectivity profile. Bioorg Med Chem17:5549-64 (2009) 
 
Cannabinoid receptor 2
Name:Cannabinoid receptor 2
Type:G Protein-Coupled Receptor (GPCR)
Mol. Mass.:39690.94
Organism:Homo sapiens (Human)
Description:P34972
Residue:360
BDBM50298917
NameBDBM50298917
Synonyms:CHEMBL574036 | N-[2-(2,4-Dichlorophenyl)ethyl]1-(2,4-difluorophenyl)-5-(2,5-dimethyl-1H-pyrrol-1-yl)-4-methyl-1H-pyrazole-3-carboxamide
TypeSmall organic molecule
Emp. Form.C25H22Cl2F2N4O
Mol. Mass.503.371
SMILESCc1ccc(C)n1-c1c(C)c(nn1-c1ccc(F)cc1F)C(=O)NCCc1ccc(Cl)cc1Cl