Reaction Details
TargetCannabinoid receptor 2
LigandBDBM50298918
Substrate/Competitorn/a
Meas. Tech.ChEMBL_588142 (CHEMBL1049259)
Ki>3940±n/a nM
Citation Silvestri, RLigresti, ALa Regina, GPiscitelli, FGatti, VBrizzi, APasquini, SLavecchia, AAllarà, MFantini, NCarai, MANovellino, EColombo, GDi Marzo, VCorelli, F Synthesis, cannabinoid receptor affinity, molecular modeling studies and in vivo pharmacological evaluation of new substituted 1-aryl-5-(1H-pyrrol-1-yl)-1H-pyrazole-3-carboxamides. 2. Effect of the 3-carboxamide substituent on the affinity and selectivity profile. Bioorg Med Chem17:5549-64 (2009) 
 
Cannabinoid receptor 2
Name:Cannabinoid receptor 2
Type:G Protein-Coupled Receptor (GPCR)
Mol. Mass.:39690.94
Organism:Homo sapiens (Human)
Description:P34972
Residue:360
BDBM50298918
NameBDBM50298918
Synonyms:CHEMBL576977 | N-[2-(3-Chloro-4-methoxyphenyl)ethyl]1-(2,4-difluorophenyl)-5-(2,5-dimethyl-1H-pyrrol-1-yl)-4-methyl-1H-pyrazole-3-carboxamide
TypeSmall organic molecule
Emp. Form.C26H25ClF2N4O2
Mol. Mass.498.952
SMILESCOc1ccc(CCNC(=O)c2nn(c(c2C)-n2c(C)ccc2C)-c2ccc(F)cc2F)cc1Cl