Reaction Details
TargetCannabinoid receptor 2
LigandBDBM50298934
Substrate/Competitorn/a
Meas. Tech.ChEMBL_588142 (CHEMBL1049259)
Ki 5.7±n/a nM
Citation Silvestri, RLigresti, ALa Regina, GPiscitelli, FGatti, VBrizzi, APasquini, SLavecchia, AAllarà, MFantini, NCarai, MANovellino, EColombo, GDi Marzo, VCorelli, F Synthesis, cannabinoid receptor affinity, molecular modeling studies and in vivo pharmacological evaluation of new substituted 1-aryl-5-(1H-pyrrol-1-yl)-1H-pyrazole-3-carboxamides. 2. Effect of the 3-carboxamide substituent on the affinity and selectivity profile. Bioorg Med Chem17:5549-64 (2009) 
 
Cannabinoid receptor 2
Name:Cannabinoid receptor 2
Type:G Protein-Coupled Receptor (GPCR)
Mol. Mass.:39690.94
Organism:Homo sapiens (Human)
Description:P34972
Residue:360
BDBM50298934
NameBDBM50298934
Synonyms:CHEMBL574270 | N-[1-(1-Phenyl)ethyl]1-(3,4-dichlorophenyl)-5-(2,5-dimethyl-1H-pyrrol-1-yl)-4-methyl-1H-pyrazole-3-carboxamide
TypeSmall organic molecule
Emp. Form.C25H24Cl2N4O
Mol. Mass.467.39
SMILESCC(NC(=O)c1nn(c(c1C)-n1c(C)ccc1C)-c1ccc(Cl)c(Cl)c1)c1ccccc1