Reaction Details
TargetCannabinoid receptor 2
LigandBDBM50298942
Substrate/Competitorn/a
Meas. Tech.ChEMBL_588142 (CHEMBL1049259)
Ki 1.6±n/a nM
Citation Silvestri, RLigresti, ALa Regina, GPiscitelli, FGatti, VBrizzi, APasquini, SLavecchia, AAllarà, MFantini, NCarai, MANovellino, EColombo, GDi Marzo, VCorelli, F Synthesis, cannabinoid receptor affinity, molecular modeling studies and in vivo pharmacological evaluation of new substituted 1-aryl-5-(1H-pyrrol-1-yl)-1H-pyrazole-3-carboxamides. 2. Effect of the 3-carboxamide substituent on the affinity and selectivity profile. Bioorg Med Chem17:5549-64 (2009) 
 
Cannabinoid receptor 2
Name:Cannabinoid receptor 2
Type:G Protein-Coupled Receptor (GPCR)
Mol. Mass.:39690.94
Organism:Homo sapiens (Human)
Description:P34972
Residue:360
BDBM50298942
NameBDBM50298942
Synonyms:(R)-N-[1-(1-Cyclohexyl)ethyl]1-(3,4-dichlorophenyl)-4-methyl-5-(1H-pyrrol-1-yl)-1H-pyrazole-3-carboxamide | CHEMBL574480
TypeSmall organic molecule
Emp. Form.C23H26Cl2N4O
Mol. Mass.445.385
SMILESC[C@@H](NC(=O)c1nn(c(c1C)-n1cccc1)-c1ccc(Cl)c(Cl)c1)C1CCCCC1