Reaction Details
TargetCannabinoid receptor 1
LigandBDBM21263
Substrate/Competitorn/a
Meas. Tech.ChEMBL_588141 (CHEMBL1049258)
Ki 5.6±n/a nM
Citation Silvestri, RLigresti, ALa Regina, GPiscitelli, FGatti, VBrizzi, APasquini, SLavecchia, AAllarà, MFantini, NCarai, MANovellino, EColombo, GDi Marzo, VCorelli, F Synthesis, cannabinoid receptor affinity, molecular modeling studies and in vivo pharmacological evaluation of new substituted 1-aryl-5-(1H-pyrrol-1-yl)-1H-pyrazole-3-carboxamides. 2. Effect of the 3-carboxamide substituent on the affinity and selectivity profile. Bioorg Med Chem17:5549-64 (2009) 
 
Cannabinoid receptor 1
Name:Cannabinoid receptor 1
Type:G Protein-Coupled Receptor (GPCR)
Mol. Mass.:52868.96
Organism:Homo sapiens (Human)
Description:P21554
Residue:472
BDBM21263
NameBDBM21263
Synonyms:N-cyclohexyl-1-(3,4-dichlorophenyl)-4-methyl-5-(1H-pyrrol-1-yl)-1H-pyrazole-3-carboxamide | Pyrazole-3-carboxamide analogue, 30
TypeSmall organic molecule
Emp. Form.C21H22Cl2N4O
Mol. Mass.417.332
SMILESCc1c(nn(c1-n1cccc1)-c1ccc(Cl)c(Cl)c1)C(=O)NC1CCCCC1