Reaction Details
Target5-hydroxytryptamine receptor 3A
LigandBDBM50081968
Substrate/Competitorn/a
Meas. Tech.ChEMBL_592418 (CHEMBL1037804)
Ki 2.2±n/a nM
Citation Butini, SBudriesi, RHamon, MMorelli, EGemma, SBrindisi, MBorrelli, GNovellino, EFiorini, IIoan, PChiarini, ACagnotto, AMennini, TFracasso, CCaccia, SCampiani, G Novel, potent, and selective quinoxaline-based 5-HT(3) receptor ligands. 1. Further structure-activity relationships and pharmacological characterization. J Med Chem52:6946-50 (2009) 
 
5-hydroxytryptamine receptor 3A
Name:5-hydroxytryptamine receptor 3A
Type:Enzyme Catalytic Domain
Mol. Mass.:55428.70
Organism:RAT
Description:5-HT3 HTR3A RAT::P35563
Residue:483
BDBM50081968
NameBDBM50081968
Synonyms:6-(4-Benzyl-piperazin-1-yl)-pyrido[2,3-e]pyrrolo[1,2-a]pyrazine CHEMBL137621
TypeSmall organic molecule
Emp. Form.C21H21N5
Mol. Mass.343.4249
SMILESC(N1CCN(CC1)c1nc2ncccc2n2cccc12)c1ccccc1