Reaction Details
TargetIndoleamine 2,3-dioxygenase 1
LigandBDBM50300305
Substrate/Competitorn/a
Meas. Tech.ChEMBL_590896 (CHEMBL1043006)
IC50 1000±n/a nM
Citation Yue, EWDouty, BWayland, BBower, MLiu, XLeffet, LWang, QBowman, KJHansbury, MJLiu, CWei, MLi, YWynn, RBurn, TCKoblish, HKFridman, JSMetcalf, BScherle, PACombs, AP Discovery of potent competitive inhibitors of indoleamine 2,3-dioxygenase with in vivo pharmacodynamic activity and efficacy in a mouse melanoma model. J Med Chem52:7364-7 (2009) 
 
Indoleamine 2,3-dioxygenase 1
Name:Indoleamine 2,3-dioxygenase 1
Type:PROTEIN
Mol. Mass.:45639.39
Organism:Mus musculus
Description:ChEMBL_1452149
Residue:407
BDBM50300305
NameBDBM50300305
Synonyms:4-Amino-N-(3-chloro-4-fluorophenyl)-N'-hydroxy-1,2,5-oxadiazole-3-carboximidamide US10669273, Compound INCB024360
TypeSmall organic molecule
Emp. Form.C9H7ClFN5O2
Mol. Mass.271.636
SMILESNc1nonc1C(NO)=Nc1ccc(F)c(Cl)c1