Reaction Details
TargetProtein-tyrosine kinase 2-beta
LigandBDBM50301363
Substrate/Competitorn/a
Meas. Tech.ChEMBL_599543 (CHEMBL1037538)
IC50 170±n/a nM
Citation Allen, JGLee, MRHan, CYScherrer, JFlynn, SBoucher, CZhao, HO'Connor, ABRoveto, PBauer, DGraceffa, RRichards, WGBabij, P Identification of small molecule inhibitors of proline-rich tyrosine kinase 2 (Pyk2) with osteogenic activity in osteoblast cells. Bioorg Med Chem Lett19:4924-8 (2009) 
 
Protein-tyrosine kinase 2-beta
Name:Protein-tyrosine kinase 2-beta
Type:Protein
Mol. Mass.:115868.80
Organism:Homo sapiens (Human)
Description:Q14289
Residue:1009
BDBM50301363
NameBDBM50301363
Synonyms:1-benzyl-N-(5-(6,7-dimethoxyquinolin-4-yloxy)pyridin-2-yl)-4-(methylamino)-2-oxo-1,2-dihydropyridine-3-carboxamide | CHEMBL570706
TypeSmall organic molecule
Emp. Form.C30H27N5O5
Mol. Mass.537.5659
SMILESCNc1ccn(Cc2ccccc2)c(=O)c1C(=O)Nc1ccc(Oc2ccnc3cc(OC)c(OC)cc23)cn1