Reaction Details
TargetFocal adhesion kinase 1
LigandBDBM50301356
Substrate/Competitorn/a
Meas. Tech.ChEMBL_599544 (CHEMBL1037539)
IC50 17000±n/a nM
Citation Allen, JGLee, MRHan, CYScherrer, JFlynn, SBoucher, CZhao, HO'Connor, ABRoveto, PBauer, DGraceffa, RRichards, WGBabij, P Identification of small molecule inhibitors of proline-rich tyrosine kinase 2 (Pyk2) with osteogenic activity in osteoblast cells. Bioorg Med Chem Lett19:4924-8 (2009) 
 
Focal adhesion kinase 1
Name:Focal adhesion kinase 1
Type:Tyrosine-protein kinase
Mol. Mass.:119233.17
Organism:Homo sapiens (Human)
Description:Q05397
Residue:1052
BDBM50301356
NameBDBM50301356
Synonyms:CHEMBL585927 | N-(5-(6,7-dimethoxyquinolin-4-yloxy)pyridin-2-yl)-4-(methylamino)-2-oxo-1-phenyl-1,2-dihydropyridine-3-carboxamide
TypeSmall organic molecule
Emp. Form.C29H25N5O5
Mol. Mass.523.5393
SMILESCNc1ccn(-c2ccccc2)c(=O)c1C(=O)Nc1ccc(Oc2ccnc3cc(OC)c(OC)cc23)cn1