Reaction Details
TargetCaspase-4
LigandBDBM50302107
Substrate/Competitorn/a
Meas. Tech.ChEMBL_600040 (CHEMBL1039233)
IC50 5000±n/a nM
Citation Kwan, JCEksioglu, EALiu, CPaul, VJLuesch, H Grassystatins A-C from marine cyanobacteria, potent cathepsin E inhibitors that reduce antigen presentation. J Med Chem52:5732-47 (2009) 
 
Caspase-4
Name:Caspase-4
Type:Enzyme
Mol. Mass.:43257.75
Organism:Homo sapiens (Human)
Description:P49662
Residue:377
BDBM50302107
NameBDBM50302107
Synonyms:CHEMBL567893 | Grassystatin A
TypeSmall organic molecule
Emp. Form.C58H95N9O16
Mol. Mass.1174.4256
SMILESCOC(=O)[C@@H]1CCCN1C(=O)[C@@H](Cc1ccccc1)N(C)C(=O)[C@H](C)NC(=O)[C@@H](NC(=O)C[C@H](O)[C@H](CC(C)C)NC(=O)[C@H](CC(N)=O)NC(=O)[C@H](CC(C)C)NC(=O)[C@H](OC(=O)[C@@H](OC(=O)[C@H](C(C)C)N(C)C)C(C)C)C(C)C)[C@@H](C)O