Reaction Details
TargetCathepsin B
LigandBDBM50302107
Substrate/Competitorn/a
Meas. Tech.ChEMBL_600049 (CHEMBL1039242)
IC50 10000±n/a nM
Citation Kwan, JCEksioglu, EALiu, CPaul, VJLuesch, H Grassystatins A-C from marine cyanobacteria, potent cathepsin E inhibitors that reduce antigen presentation. J Med Chem52:5732-47 (2009) 
 
Cathepsin B
Name:Cathepsin B
Type:Enzyme
Mol. Mass.:37819.69
Organism:Homo sapiens (Human)
Description:gi_63102437
Residue:339
BDBM50302107
NameBDBM50302107
Synonyms:CHEMBL567893 | Grassystatin A
TypeSmall organic molecule
Emp. Form.C58H95N9O16
Mol. Mass.1174.4256
SMILESCOC(=O)[C@@H]1CCCN1C(=O)[C@@H](Cc1ccccc1)N(C)C(=O)[C@H](C)NC(=O)[C@@H](NC(=O)C[C@H](O)[C@H](CC(C)C)NC(=O)[C@H](CC(N)=O)NC(=O)[C@H](CC(C)C)NC(=O)[C@H](OC(=O)[C@@H](OC(=O)[C@H](C(C)C)N(C)C)C(C)C)C(C)C)[C@@H](C)O