Reaction Details
TargetDisintegrin and metalloproteinase domain-containing protein 10
LigandBDBM50302109
Substrate/Competitorn/a
Meas. Tech.ChEMBL_600034 (CHEMBL1039227)
IC50 87200±n/a nM
Citation Kwan, JCEksioglu, EALiu, CPaul, VJLuesch, H Grassystatins A-C from marine cyanobacteria, potent cathepsin E inhibitors that reduce antigen presentation. J Med Chem52:5732-47 (2009) 
 
Disintegrin and metalloproteinase domain-containing protein 10
Name:Disintegrin and metalloproteinase domain-containing protein 10
Type:Enzyme
Mol. Mass.:84160.93
Organism:Homo sapiens (Human)
Description:O14672
Residue:748
BDBM50302109
NameBDBM50302109
Synonyms:CHEMBL568553 | Grassystatin B
TypeSmall organic molecule
Emp. Form.C59H97N9O16
Mol. Mass.1188.4522
SMILESCC[C@H](NC(=O)[C@@H](NC(=O)C[C@H](O)[C@H](CC(C)C)NC(=O)[C@H](CC(N)=O)NC(=O)[C@H](CC(C)C)NC(=O)[C@H](OC(=O)[C@@H](OC(=O)[C@H](C(C)C)N(C)C)C(C)C)C(C)C)[C@@H](C)O)C(=O)N(C)[C@H](Cc1ccccc1)C(=O)N1CCC[C@H]1C(=O)OC