Reaction Details
TargetDisintegrin and metalloproteinase domain-containing protein 17
LigandBDBM50302108
Substrate/Competitorn/a
Meas. Tech.ChEMBL_600085 (CHEMBL1041950)
IC50 28600±n/a nM
Citation Kwan, JCEksioglu, EALiu, CPaul, VJLuesch, H Grassystatins A-C from marine cyanobacteria, potent cathepsin E inhibitors that reduce antigen presentation. J Med Chem52:5732-47 (2009) 
 
Disintegrin and metalloproteinase domain-containing protein 17
Name:Disintegrin and metalloproteinase domain-containing protein 17
Type:Enzyme
Mol. Mass.:93007.89
Organism:Homo sapiens (Human)
Description:
Residue:824
BDBM50302108
NameBDBM50302108
Synonyms:CHEMBL569445 | Grassystatin C
TypeSmall organic molecule
Emp. Form.C50H82N8O12
Mol. Mass.987.2325
SMILESCC[C@H](C)[C@@H](O)C(=O)N[C@@H](CC(C)C)C(=O)N(C)[C@@H](CCC(N)=O)C(=O)N[C@@H](CC(C)C)[C@@H](O)CC(=O)N[C@@H]([C@@H](C)CC)C(=O)NCC(=O)N(C)[C@H](Cc1ccccc1)C(=O)N1CCC[C@H]1C(=O)OC