Reaction Details
TargetSodium/glucose cotransporter 2
LigandBDBM50302607
Substrate/Competitorn/a
Meas. Tech.ChEMBL_594780 (CHEMBL1040741)
IC50 3600±n/a nM
Citation Goodwin, NCMabon, RHarrison, BAShadoan, MKAlmstead, ZYXie, YHealy, JBuhring, LMDaCosta, CMBardenhagen, JMseeh, FLiu, QNouraldeen, AWilson, AGKimball, SDPowell, DRRawlins, DB Novel L-xylose derivatives as selective sodium-dependent glucose cotransporter 2 (SGLT2) inhibitors for the treatment of type 2 diabetes. J Med Chem52:6201-4 (2009) 
 
Sodium/glucose cotransporter 2
Name:Sodium/glucose cotransporter 2
Type:Protein
Mol. Mass.:72902.00
Organism:Homo sapiens (Human)
Description:P31639
Residue:672
BDBM50302607
NameBDBM50302607
Synonyms:(2S,3R,4R,5S)-2-(4-chloro-3-(4-ethoxybenzyl)phenyl)-6-(2-(dimethylamino)ethoxy)tetrahydro-2H-pyran-3,4,5-triol | CHEMBL567954
TypeSmall organic molecule
Emp. Form.C24H32ClNO6
Mol. Mass.465.967
SMILESCCOc1ccc(Cc2cc(ccc2Cl)[C@@H]2OC(OCCN(C)C)[C@@H](O)[C@H](O)[C@H]2O)cc1