Reaction Details
TargetSodium/glucose cotransporter 2
LigandBDBM50302622
Substrate/Competitorn/a
Meas. Tech.ChEMBL_594780 (CHEMBL1040741)
IC50 1100±n/a nM
Citation Goodwin, NCMabon, RHarrison, BAShadoan, MKAlmstead, ZYXie, YHealy, JBuhring, LMDaCosta, CMBardenhagen, JMseeh, FLiu, QNouraldeen, AWilson, AGKimball, SDPowell, DRRawlins, DB Novel L-xylose derivatives as selective sodium-dependent glucose cotransporter 2 (SGLT2) inhibitors for the treatment of type 2 diabetes. J Med Chem52:6201-4 (2009) 
 
Sodium/glucose cotransporter 2
Name:Sodium/glucose cotransporter 2
Type:Protein
Mol. Mass.:72902.00
Organism:Homo sapiens (Human)
Description:P31639
Residue:672
BDBM50302622
NameBDBM50302622
Synonyms:(2S,3R,4R,5S)-2-(3-(4-Ethoxybenzyl)phenyl)-6-methoxytetrahydro-2H-pyran-3,4,5-triol | CHEMBL568398
TypeSmall organic molecule
Emp. Form.C21H26O6
Mol. Mass.374.4275
SMILESCCOc1ccc(Cc2cccc(c2)[C@@H]2OC(OC)[C@@H](O)[C@H](O)[C@H]2O)cc1