Reaction Details
TargetSodium/glucose cotransporter 2
LigandBDBM50302618
Substrate/Competitorn/a
Meas. Tech.ChEMBL_594779 (CHEMBL1040740)
IC50 1900±n/a nM
Citation Goodwin, NCMabon, RHarrison, BAShadoan, MKAlmstead, ZYXie, YHealy, JBuhring, LMDaCosta, CMBardenhagen, JMseeh, FLiu, QNouraldeen, AWilson, AGKimball, SDPowell, DRRawlins, DB Novel L-xylose derivatives as selective sodium-dependent glucose cotransporter 2 (SGLT2) inhibitors for the treatment of type 2 diabetes. J Med Chem52:6201-4 (2009) 
 
Sodium/glucose cotransporter 2
Name:Sodium/glucose cotransporter 2
Type:Protein
Mol. Mass.:73014.31
Organism:Mus musculus (Mouse)
Description:Q923I7
Residue:670
BDBM50302618
NameBDBM50302618
Synonyms:(2S,3R,4R,5S)-2-(4'-Ethoxybiphenyl-4-yl)-6-methoxytetrahydro-2H-pyran-3,4,5-triol | CHEMBL567777
TypeSmall organic molecule
Emp. Form.C20H24O6
Mol. Mass.360.401
SMILESCCOc1ccc(cc1)-c1cccc(c1)[C@@H]1OC(OC)[C@@H](O)[C@H](O)[C@H]1O