Reaction Details
TargetTyrosine-protein kinase JAK2
LigandBDBM50303078
Substrate/Competitorn/a
Meas. Tech.ChEMBL_597287 (CHEMBL1044318)
IC50 3.6±n/a nM
Citation Ledeboer, MWPierce, ACDuffy, JPGao, HMessersmith, DSalituro, FGNanthakumar, SCome, JZuccola, HJSwenson, LShlyakter, DMahajan, SHoock, TFan, BTsai, WJKolaczkowski, ECarrier, SHogan, JKZessis, RPazhanisamy, SBennani, YL 2-Aminopyrazolo[1,5-a]pyrimidines as potent and selective inhibitors of JAK2. Bioorg Med Chem Lett19:6529-33 (2009) 
 
Tyrosine-protein kinase JAK2
Name:Tyrosine-protein kinase JAK2
Type:Protein
Mol. Mass.:130684.68
Organism:Homo sapiens (Human)
Description:O60674
Residue:1132
BDBM50303078
NameBDBM50303078
Synonyms:1-(6-(2-aminopyrazolo[1,5-a]pyrimidin-3-yl)pyrimidin-4-yl)-N-ethyl-N-propylpiperidine-3-carboxamide | CHEMBL569757
TypeSmall organic molecule
Emp. Form.C21H28N8O
Mol. Mass.408.5
SMILESCCCN(CC)C(=O)C1CCCN(C1)c1cc(ncn1)-c1c(N)nn2cccnc12