Reaction Details
TargetTyrosine-protein kinase JAK2
LigandBDBM50303059
Substrate/Competitorn/a
Meas. Tech.ChEMBL_597287 (CHEMBL1044318)
IC50 6±n/a nM
Citation Ledeboer, MWPierce, ACDuffy, JPGao, HMessersmith, DSalituro, FGNanthakumar, SCome, JZuccola, HJSwenson, LShlyakter, DMahajan, SHoock, TFan, BTsai, WJKolaczkowski, ECarrier, SHogan, JKZessis, RPazhanisamy, SBennani, YL 2-Aminopyrazolo[1,5-a]pyrimidines as potent and selective inhibitors of JAK2. Bioorg Med Chem Lett19:6529-33 (2009) 
 
Tyrosine-protein kinase JAK2
Name:Tyrosine-protein kinase JAK2
Type:Protein
Mol. Mass.:130684.68
Organism:Homo sapiens (Human)
Description:O60674
Residue:1132
BDBM50303059
NameBDBM50303059
Synonyms:3-(6-(benzylamino)pyrimidin-4-yl)pyrazolo[1,5-a]pyrimidin-2-amine | CHEMBL570890
TypeSmall organic molecule
Emp. Form.C17H15N7
Mol. Mass.317.3479
SMILESNc1nn2cccnc2c1-c1cc(NCc2ccccc2)ncn1