Reaction Details
TargetTyrosine-protein kinase JAK2
LigandBDBM50303070
Substrate/Competitorn/a
Meas. Tech.ChEMBL_597287 (CHEMBL1044318)
IC50 0.2±n/a nM
Citation Ledeboer, MWPierce, ACDuffy, JPGao, HMessersmith, DSalituro, FGNanthakumar, SCome, JZuccola, HJSwenson, LShlyakter, DMahajan, SHoock, TFan, BTsai, WJKolaczkowski, ECarrier, SHogan, JKZessis, RPazhanisamy, SBennani, YL 2-Aminopyrazolo[1,5-a]pyrimidines as potent and selective inhibitors of JAK2. Bioorg Med Chem Lett19:6529-33 (2009) 
 
Tyrosine-protein kinase JAK2
Name:Tyrosine-protein kinase JAK2
Type:Protein
Mol. Mass.:130684.68
Organism:Homo sapiens (Human)
Description:O60674
Residue:1132
BDBM50303070
NameBDBM50303070
Synonyms:(R)-3-(6-(1-(4-fluorophenyl)ethylamino)pyrimidin-4-yl)pyrazolo[1,5-a]pyrimidin-2-amine | CHEMBL583895
TypeSmall organic molecule
Emp. Form.C18H16FN7
Mol. Mass.349.3649
SMILESC[C@@H](Nc1cc(ncn1)-c1c(N)nn2cccnc12)c1ccc(F)cc1