Reaction Details
TargetPteridine reductase 1
LigandBDBM50303507
Substrate/Competitorn/a
Meas. Tech.ChEMBL_596055 (CHEMBL1037349)
Ki>27000±n/a nM
Citation Tulloch, LBMartini, VPIulek, JHuggan, JKLee, JHGibson, CLSmith, TKSuckling, CJHunter, WN Structure-based design of pteridine reductase inhibitors targeting African sleeping sickness and the leishmaniases. J Med Chem53:221-9 (2010) 
 
Pteridine reductase 1
Name:Pteridine reductase 1
Type:PROTEIN
Mol. Mass.:30459.34
Organism:Leishmania major
Description:ChEMBL_1470027
Residue:288
BDBM50303507
NameBDBM50303507
Synonyms:2-amino-4-oxo-4,7-dihydro-3H-pyrrolo[2,3-d]pyrimidine-5-carbonitrile | CHEMBL577120
TypeSmall organic molecule
Emp. Form.C7H5N5O
Mol. Mass.175.1475
SMILESNc1nc2[nH]cc(C#N)c2c(=O)[nH]1