Reaction Details
TargetPteridine reductase 1
LigandBDBM50303517
Substrate/Competitorn/a
Meas. Tech.ChEMBL_596055 (CHEMBL1037349)
Ki 27000±n/a nM
Citation Tulloch, LBMartini, VPIulek, JHuggan, JKLee, JHGibson, CLSmith, TKSuckling, CJHunter, WN Structure-based design of pteridine reductase inhibitors targeting African sleeping sickness and the leishmaniases. J Med Chem53:221-9 (2010) 
 
Pteridine reductase 1
Name:Pteridine reductase 1
Type:PROTEIN
Mol. Mass.:30459.34
Organism:Leishmania major
Description:ChEMBL_1470027
Residue:288
BDBM50303517
NameBDBM50303517
Synonyms:2,4-diamino-6-(p-tolylthio)pyrimidin-1-ium CHEMBL578789
TypeSmall organic molecule
Emp. Form.C11H12N4S
Mol. Mass.232.305
SMILESCc1ccc(Sc2cc(N)nc(N)n2)cc1