Reaction Details
Target5-hydroxytryptamine receptor 6
LigandBDBM50303989
Substrate/Competitorn/a
Meas. Tech.ChEMBL_595421 (CHEMBL1040062)
Ki>1000±n/a nM
Citation de la Fuente, TMartín-Fontecha, MSallander, JBenhamú, BCampillo, MMedina, RAPellissier, LPClaeysen, SDumuis, APardo, LLópez-Rodríguez, ML Benzimidazole derivatives as new serotonin 5-HT6 receptor antagonists. Molecular mechanisms of receptor inactivation. J Med Chem53:1357-69 (2010) 
 
5-hydroxytryptamine receptor 6
Name:5-hydroxytryptamine receptor 6
Type:G Protein-Coupled Receptor (GPCR)
Mol. Mass.:46968.43
Organism:Homo sapiens (Human)
Description:P50406
Residue:440
BDBM50303989
NameBDBM50303989
Synonyms:2-Benzyl-5-piperazin-1-yl-1H-benzimidazole | CHEMBL566639
TypeSmall organic molecule
Emp. Form.C18H20N4
Mol. Mass.292.3782
SMILESC(c1nc2ccc(cc2[nH]1)N1CCNCC1)c1ccccc1