Reaction Details
Target5-hydroxytryptamine receptor 6
LigandBDBM50303995
Substrate/Competitorn/a
Meas. Tech.ChEMBL_595421 (CHEMBL1040062)
Ki>1000±n/a nM
Citation de la Fuente, TMartín-Fontecha, MSallander, JBenhamú, BCampillo, MMedina, RAPellissier, LPClaeysen, SDumuis, APardo, LLópez-Rodríguez, ML Benzimidazole derivatives as new serotonin 5-HT6 receptor antagonists. Molecular mechanisms of receptor inactivation. J Med Chem53:1357-69 (2010) 
 
5-hydroxytryptamine receptor 6
Name:5-hydroxytryptamine receptor 6
Type:G Protein-Coupled Receptor (GPCR)
Mol. Mass.:46968.43
Organism:Homo sapiens (Human)
Description:P50406
Residue:440
BDBM50303995
NameBDBM50303995
Synonyms:CHEMBL566409 | [4-(4-Methylpiperazin-1-yl)-1H-benzimidazol-2-yl](phenyl)methanone
TypeSmall organic molecule
Emp. Form.C19H20N4O
Mol. Mass.320.3883
SMILESCN1CCN(CC1)c1cccc2[nH]c(nc12)C(=O)c1ccccc1